produzione edilizia
type: Concept
broader: https://w3id.org/italia/controlled-vocabulary/classifications-for-culture/subject-disciplines/010
notation: 010.014
editorial note: Fonte: Decreto Ministeriale 4 ottobre 2000 [In rete] http://attiministeriali.miur.it/anno-2000/ottobre/dm-04102000.aspx (26 febbraio 2018)
has rank order: 2
definition: I contenuti scientifico-disciplinari attengono all'analisi del rapporto fra progetto e costruzione, all'interno della concezione integrata del processo edilizio e della sua sostenibilità. La problematica riguarda quindi aspetti tecnologici della progettazione, realizzazione, diagnostica, manutenzione e trasformazione di organismi e sistemi nuovi od oggetto di recupero, allo scopo di ottenere una produzione edilizia che esprima la compatibilità tra finalità progettuali, prescrizioni normative, controlli di qualità e prestazioni, esigenze organizzative, condizionamenti socioeconomici ed ambientali, garanzie di sicurezza e di conseguire una vita utile programmata ed un invecchiamento controllato delle opere. Sono oggetto di studio e sperimentazione materiali, componenti, sistemi ed organismi edilizi, tecniche edili, cantieri.
preferred label: building production @en
in scheme: subject-disciplines