architettura del paesaggio
type: Concept
broader: https://w3id.org/italia/controlled-vocabulary/classifications-for-culture/subject-disciplines/010
notation: 010.017
editorial note: Fonte: Decreto Ministeriale 4 ottobre 2000 [In rete] http://attiministeriali.miur.it/anno-2000/ottobre/dm-04102000.aspx (26 febbraio 2018)
has rank order: 2
definition: I contenuti scientifico-disciplinari hanno per oggetto l'assetto paesistico del territorio, delle aree non edificate e degli spazi aperti, nonché l'organizzazione del verde, quale sistema entro cui si colloca la parte costruita delle città e del territorio. Riconoscendo come elementi fondanti le diversità ambientali e le preesistenze storiche, culturali, ecologiche ed estetiche e come carattere qualificante la valorizzazione delle procedure dell'ecologia nei processi di progettazione, comprendono attività riguardanti la pianificazione e gestione paesistica del territorio, la progettazione dei sistemi del verde urbano, la riqualificazione ed il recupero delle aree degradate, la progettazione dei giardini e dei parchi, l'inserimento paesistico delle infrastrutture ed il controllo dell'evoluzione del paesaggio.
preferred label: landscape architecture @en
in scheme: subject-disciplines