architettura degli interni e allestimento
type: Concept
notation: 010.018
alternative label: architettura degli interni
alternative label: allestimento
preferred label: interior design and staging @en
has rank order: 2
editorial note: Fonte: Decreto Ministeriale 4 ottobre 2000 [In rete] http://attiministeriali.miur.it/anno-2000/ottobre/dm-04102000.aspx (26 febbraio 2018)
definition: I contenuti scientifico-disciplinari si distinguono dal ceppo centrale delle tematiche afferenti al campo della progettazione architettonica, in quanto fanno riferimento a temi che hanno un'autonomia particolare per metodo e strumenti, implicando peraltro interazioni con diversi altri settori. Riguardano aspetti teorici dell'architettura focalizzati sulle relazioni fra spazi fruibili, oggetti, immagini, persone ed aspetti applicativi legati alle problematiche progettuali specifiche dell'architettura d'interni e dell'arredamento, nonché a quelle dell'allestimento, della museografia, della scenografia, della decorazione.
related match: progettazione di interni
in scheme: subject-disciplines
broader: https://w3id.org/italia/controlled-vocabulary/classifications-for-culture/subject-disciplines/010