storia dell'architettura
type: Concept
broader: https://w3id.org/italia/controlled-vocabulary/classifications-for-culture/subject-disciplines/010
notation: 010.020
editorial note: Fonte: Decreto Ministeriale 4 ottobre 2000 [In rete] http://attiministeriali.miur.it/anno-2000/ottobre/dm-04102000.aspx (26 febbraio 2018)
has rank order: 2
definition: I contenuti scientifico-disciplinari riguardano la storia delle attività edilizie e di altre attinenti alla formazione e trasformazione dell'ambiente (giardini, parchi, paesaggio, città, territorio), in rapporto al quadro politico, economico, sociale, culturale delle varie epoche; gli argomenti storici concernenti aspetti specifici di tali attività, dalla rappresentazione dello spazio architettonico alle tecniche edilizie; la storia del pensiero e delle teorie sull'architettura; lo studio critico dell'opera architettonica, esaminata nel suo contesto con riferimento alle cause, ai programmi ed all'uso, nelle sue modalità linguistiche e tecniche, nella sua realtà costruita, nei suoi significati.
preferred label: architectural history @en
in scheme: subject-disciplines