restauro architettonico
type: Concept
editorial note: Modificato rispetto al Decreto Ministeriale 4 ottobre 2000, perché categoria che non si riferisce ai beni mobili
preferred label: architectural restoration @en
broader: https://w3id.org/italia/controlled-vocabulary/classifications-for-culture/subject-disciplines/010
notation: 010.021
in scheme: subject-disciplines
has rank order: 2
definition: I contenuti scientifico-disciplinari comprendono i fondamenti teorici della tutela dei valori culturali del costruito, visti anche nella loro evoluzione temporale; le ricerche per la comprensione delle opere nella loro consistenza figurale, materiale, costruttiva e nella loro complessità cronologica, nonché per la diagnosi dei fenomeni di degrado, ai fini di decisioni sulle azioni di tutela; i metodi ed i processi per l'intervento conservativo a scala di edificio, monumento, resto archeologico, parco o giardino storico, centro storico, territorio e per il risanamento, la riqualificazione tecnologica, il consolidamento, la ristrutturazione degli edifici storici.
related match: restauro