tecnica e pianificazione urbanistica
type: Concept
broader: 010
definition: I contenuti scientifico-disciplinari investono l'analisi e la valutazione dei sistemi urbani e territoriali, esaminati nel loro contesto ambientale e nel quadro dei rischi naturali ed antropici cui sono soggetti e delle variabili socioeconomiche dalle quali sono influenzati; i modelli ed i metodi per l'identificazione dei caratteri qualificanti le diverse politiche di gestione e programmazione degli interventi, nonché per l'esplicitazione dei processi decisionali che ne governano gli effetti sull'evoluzione dei sistemi in oggetto; le tecniche per gli strumenti di pianificazione a tutte le scale.
editorial note: Fonte: Decreto Ministeriale 4 ottobre 2000 [In rete] http://attiministeriali.miur.it/anno-2000/ottobre/dm-04102000.aspx (26 febbraio 2018)
in scheme: subject-disciplines
notation: 010.022
preferred label: urban and regional planning @en
related match: http://thes.bncf.firenze.sbn.it/termine.php
has rank order: 2