architettura navale
type: Concept
definition: Il settore comprende gli studi inerenti alla concezione ed alla progettazione della forma dello scafo di una nave o di un mezzo navale e del suo sistema di propulsione, tradizionale o non convenzionale, che soddisfino tutte le richieste dell'armatore per quanto riguarda la tipologia e l'entità del carico da trasportare, le prestazioni in mare, la manovrabilità ed il governo, il consumo energetico, la condotta e la sicurezza operativa, il comportamento in mare ondoso e conseguenti moti, accelerazioni e comfort a bordo.
has rank order: 2
preferred label: naval architecture @en
in scheme: subject-disciplines
broader: https://w3id.org/italia/controlled-vocabulary/classifications-for-culture/subject-disciplines/011
related match: http://thes.bncf.firenze.sbn.it/termine.php
notation: 011.001
editorial note: Fonte: Decreto Ministeriale 4 ottobre 2000 [In rete] http://attiministeriali.miur.it/anno-2000/ottobre/dm-04102000.aspx (26 febbraio 2018)