meccanica del volo
type: Concept
broader: https://w3id.org/italia/controlled-vocabulary/classifications-for-culture/subject-disciplines/011
notation: 011.003
editorial note: Fonte: Decreto Ministeriale 4 ottobre 2000 [In rete] http://attiministeriali.miur.it/anno-2000/ottobre/dm-04102000.aspx (26 febbraio 2018)
has rank order: 2
definition: Il settore studia il progetto aeromeccanico, la missione di volo, il controllo manuale e/o automatico, le qualita' di volo di veicoli operanti in ambito atmosferico e spaziale. Queste tematiche rivestono un ruolo fondamentale ai fini della caratterizzazione della sicurezza e della gestione di un veicolo aerospaziale e della sua missione. Le competenze del settore riguardano il progetto preliminare, le prestazioni, la stabilita', il controllo, lo studio della traiettoria e le problematiche di interfaccia uomo/macchina della predetta classe di veicoli. Le metodologie di analisi e verifica, condotte attraverso modellizzazione, simulazione e sperimentazione, rivestono un ruolo fortemente unificante e qualificante nell'ambito delle predette tematiche.
preferred label: flight mechanics @en
in scheme: subject-disciplines