sistemi per l'energia e l'ambiente
type: Concept
broader: https://w3id.org/italia/controlled-vocabulary/classifications-for-culture/subject-disciplines/011
notation: 011.009
editorial note: Fonte: Decreto Ministeriale 4 ottobre 2000 [In rete] http://attiministeriali.miur.it/anno-2000/ottobre/dm-04102000.aspx (26 febbraio 2018)
has rank order: 2
definition: Il settore studia i sistemi destinati alla conversione dell’energia nelle sue varie forme: dalle centrali termoelettriche alimentate da combustibili fossili, alle centrali idroelettriche ed elettronucleari, alla cogenerazione nei settori industriale, terziario e residenziale, alle tecnologie rivolte alla trasformazione delle energie rinnovabili (solare, eolica, biomasse, rifiuti solidi urbani e rifiuti industriali), all’utilizzo dell’energia geotermica, alle centrali termiche e frigorifere, ai processi di trasporto e di accumulo dell’energia, alle varie forme di conversione diretta dell’energia. I sistemi energetici e le macchine che li compongono sono studiati con riferimento alle problematiche termodinamiche, fluidodinamiche, tecnologiche, ambientali, di sicurezza, di diagnostica e di controllo. Il settore studia, altresì, l’impatto ambientale dei sistemi energetici e le tecnologie rivolte al suo contenimento.
preferred label: energy systems and power generation @en
in scheme: subject-disciplines