fisica tecnica ambientale
type: Concept
broader: https://w3id.org/italia/controlled-vocabulary/classifications-for-culture/subject-disciplines/011
notation: 011.011
editorial note: Fonte: Decreto Ministeriale 4 ottobre 2000 [In rete] http://attiministeriali.miur.it/anno-2000/ottobre/dm-04102000.aspx (26 febbraio 2018)
has rank order: 2
definition: Il settore studia gli aspetti fondamentali ed applicativi della termofluidodinamica, della trasmissione del calore, dell’energetica, dell’illuminazione e dell’acustica applicata sia negli ambiti dell’ingegneria industriale, civile ed ambientale sia negli ambiti della pianificazione territoriale, dell’architettura e del disegno industriale. Nel settore trovano terreno di crescita le competenze riguardanti la fisica dell’ambiente confinato (termofisica dell’edificio, termofluidodinamica ambientale, illuminotecnica, acustica ambientale), i condizionamenti ambientali per il benessere dell’uomo e la conservazione dei manufatti (comfort termico, qualità dell’aria, comfort visivo, comfort acustico, ergonomia dell’ambiente confinato, conservazione dei beni artistici ed architettonici), le metodologie di analisi ambientale (tecniche di rilevamento ed elaborazione dei dati ambientali), le tecnologie passive ed i sistemi impiantistici per il soddisfacimento dei requisiti ambientali (climatizzazione, illuminazione ed acustica), la pianificazione energetica ed ambientale e la gestione dei servizi energetici a scala territoriale, urbana ed edilizia (uso razionale dell’energia; fonti energetiche e tecnologie correlate; inquinamenti termici, atmosferici, luminosi ed acustici).
preferred label: building physics and building energy systems @en
in scheme: subject-disciplines