progettazione meccanica e costruzione di macchine
type: Concept
broader: https://w3id.org/italia/controlled-vocabulary/classifications-for-culture/subject-disciplines/011
notation: 011.014
definition: Il settore raccoglie le competenze relative alla progettazione, alla costruzione ed alla sperimentazione di macchine, di strutture e di sistemi meccanici: principi e metodologie della progettazione meccanica, dagli elementi costruttivi delle macchine e dal comportamento meccanico dei materiali alla progettazione affidabilistica dei sistemi meccanici, all'ottimizzazione, alla progettazione integrata di prodotto e processo; modellazione numerica, progettazione e sperimentazione relative alla qualità, alla sicurezza, all’interazione uomo-macchina, alla valutazione economica, alla compatibilità ambientale, alla producibilità ed alla manutenibilità; progettazione e costruzione di sistemi meccanici e meccatronici, di motori, di apparecchi in pressione, di macchine automatiche e robot, di macchine di sollevamento e trasporto, di sistemi biomeccanici, di sistemi e componenti micromeccanici, di componenti e strutture per impianti industriali, di componenti meccanici per applicazioni aeronautiche e spaziali; metodi sperimentali di misura ed analisi dello stato di deformazione e di tensione, metodi puntuali ed a campo intero della meccanica sperimentale dei solidi, metodi per l’analisi dinamica e modale, meccanica dei materiali sottoposti alle sollecitazioni tipiche d’esercizio, prove sui prototipi, collaudo e controllo in esercizio, diagnostica strutturale, controlli non distruttivi progettazione degli esperimenti, analisi statistica e costruzione di modelli; teoria e tecnica dei veicoli terrestri, progettazione meccanica e sistemica e sperimentazione degli autoveicoli, dei veicoli ferroviari, delle macchine agricole e movimento terra e dei loro componenti, ivi compreso il motore.
alternative label: progettazione meccanica
editorial note: Fonte: Decreto Ministeriale 4 ottobre 2000 [In rete] http://attiministeriali.miur.it/anno-2000/ottobre/dm-04102000.aspx (26 febbraio 2018)
in scheme: subject-disciplines
preferred label: mechanical design and machine construction @en
alternative label: costruzione di macchine
has rank order: 2