metallurgia
type: Concept
has rank order: 2
broader: https://w3id.org/italia/controlled-vocabulary/classifications-for-culture/subject-disciplines/011
preferred label: metallurgy @en
in scheme: subject-disciplines
definition: Il settore studia i fondamenti e la realizzazione dei processi di fabbricazione e di trasformazione dei materiali metallici; le materie prime ed i relativi trattamenti, principi, processi, impianti metallurgici; i ricicli ed i recuperi; i processi di formatura; le proprietà chimiche, fisiche, meccaniche, tecnologiche dei metalli e delle leghe; i relativi metodi di studio e controllo; la relazione tra struttura submicroscopica e microscopica e proprietà; la difettologia; le trasformazioni tra fasi, con particolare attenzione a trasformazioni nello stato solido, fondamento dei trattamenti atti a modificare le suddette proprietà, trasformazioni solido/liquido, per la rilevanza nella fonderia e nella saldatura, altre trasformazioni; i meccanismi di alterazione/degradazione dei materiali metallici ed i relativi interventi; i trattamenti (meccanici, termici, termochimici, termomeccanici ed altri, che interessino massa e superficie) a carico dei materiali metallici in vista dell’impiego; le caratteristiche di impiego e i parametri determinanti il comportamento in opera dei materiali metallici; la qualificazione e scelta; il mercato; la classificazione, la designazione, i costi.
notation: 011.021
related match: http://thes.bncf.firenze.sbn.it/termine.php
editorial note: Fonte: Decreto Ministeriale 4 ottobre 2000 [In rete] http://attiministeriali.miur.it/anno-2000/ottobre/dm-04102000.aspx (26 febbraio 2018)