principi di ingegneria chimica
type: Concept
broader: https://w3id.org/italia/controlled-vocabulary/classifications-for-culture/subject-disciplines/011
notation: 011.024
editorial note: Fonte: Decreto Ministeriale 4 ottobre 2000 [In rete] http://attiministeriali.miur.it/anno-2000/ottobre/dm-04102000.aspx (26 febbraio 2018)
has rank order: 2
definition: Il settore ha come oggetto il "Basic Process Design", ovvero lo sviluppo delle metodologie e delle tecnologie dell’industria di processo (chimica, petrolchimica, biotecnologica, alimentare, farmaceutica, di produzione e trasformazione di materiali), sulla base dei fenomeni fisici, chimici e biologici che caratterizzano le specifiche trasformazioni. Lo studio è affrontato in un’ottica di sistema, utilizzando gli strumenti della termodinamica, della cinetica chimica, dei fenomeni di trasporto, per analizzare i singoli stadi dei processi e delle apparecchiature e ricomporli in una visione unitaria, funzionale all'individuazione ed alla quantificazione di interventi operativi e progettuali. Le applicazioni sono rivolte, oltre che all’industria di processo, anche all’ingegneria ambientale, biomedica e ai problemi della sicurezza e sono finalizzate allo sviluppo di nuove tecnologie rispondenti ad esigenze economiche, energetiche e di compatibilità ambientale. Competenze caratterizzanti includono i fenomeni di trasporto (scambio termico e di materia fra fasi, anche in presenza di reazioni chimiche, e relative apparecchiature; meccanica di fluidi newtoniani, non-newtoniani e di sistemi polifasici; reologia; controllo della dispersione di inquinanti nell'ambiente); la cinetica e reattoristica chimica e biochimica; la termodinamica chimica e di processo (analisi energetica dei processi; sistemi multicomponenti, anche in condizioni operative estreme; equilibri chimici tra fasi e relative applicazioni).
preferred label: fundamentals of chemical engineering @en
in scheme: subject-disciplines