teoria dello sviluppo dei processi chimici
type: Concept
broader: https://w3id.org/italia/controlled-vocabulary/classifications-for-culture/subject-disciplines/011
notation: 011.026
editorial note: Fonte: Decreto Ministeriale 4 ottobre 2000 [In rete] http://attiministeriali.miur.it/anno-2000/ottobre/dm-04102000.aspx (26 febbraio 2018)
has rank order: 2
definition: Il settore è caratterizzato dall'approccio sistemistico allo studio dei processi e dei fenomeni chimici e fisici coinvolti. Tale approccio è finalizzato alla ottimizzazione, al controllo ed alla conduzione delle apparecchiature e dei processi industriali. Le tematiche qualificanti del settore riguardano lo sviluppo e l'applicazione di: metodi matematici per l'analisi, la modellistica, l'identificazione e la simulazione anche con metodi numerici di sistemi dell'industria di processo; metodi di ottimizzazione (di progetto e conduzione) di apparecchiature e processi; metodi statistici e probabilistici per l'industria di processo; metodologie per l'analisi statistica di dati e la programmazione della sperimentazione in scala di laboratorio, in scala pilota ed in scala industriale; metodologie di scale-up; modelli matematici per lo sviluppo di processi; metodologie per lo studio della dinamica, e per l'analisi e sintesi dei sistemi di controllo di processi anche in relazione alla sicurezza. Le competenze del settore sono finalizzate alla caratterizzazione ed allo sviluppo di processi con attenzione agli aspetti energetici, economici e di interazione con l'ambiente per le industrie chimiche, biotecnologiche, alimentari, farmaceutiche e per la produzione e trasformazione dei materiali.
preferred label: analysis, design and control of chemical processes @en
in scheme: subject-disciplines