ingegneria e sicurezza degli scavi
type: Concept
broader: 011
definition: Il settore comprende gli studi e le ricerche rivolti alla realizzazione di scavi, a cielo aperto ed in sotterraneo, nelle terre e nelle rocce, per la produzione di materie prime nelle miniere e nelle cave (minerali di prima e seconda categoria, rocce ornamentali, prodotti lapidei) e per la costruzione di gallerie ed altre opere in sotterraneo per servizi o per l'insediamento di funzioni della vita associata, nonché all’attuazione di interventi sul terreno per la bonifica delle pareti in roccia e la decontaminazione in situ dei suoli inquinati. Sono affrontati i problemi di progettazione ed esecuzione di sistemi complessi, la cui soluzione richiede l’identificazione e la caratterizzazione dell’oggetto dell’attività di scavo, la scelta dei metodi appropriati, il perfezionamento delle tecnologie tradizionali e lo sviluppo di tecnologie avanzate di abbattimento, demolizione e taglio, l’organizzazione del lavoro nel rispetto della sicurezza e della salubrità dell’ambiente di lavoro ed esterno, la verifica ed il controllo delle condizioni operative durante lo svolgimento dell’attività di scavo e nel periodo di utilizzazione dell’opera realizzata, gli interventi di messa in sicurezza e di riabilitazione ambientale.
editorial note: Fonte: Decreto Ministeriale 4 ottobre 2000 [In rete] http://attiministeriali.miur.it/anno-2000/ottobre/dm-04102000.aspx (26 febbraio 2018)
in scheme: subject-disciplines
notation: 011.028
preferred label: excavation engineering and safety @en
has rank order: 2