sistemi elettrici per l'energia
type: Concept
broader: 011
definition: Il settore studia gli impianti ed i sistemi elettrici ed elettronici per l’energia. Lo spettro delle applicazioni considerate si estende a tutti i sistemi di componenti interconnessi che utilizzano vettori elettrici energeticamente significativi e spazia quindi dalla produzione (da fonti tradizionali o alternative, con cogenerazione, con accumulo, etc.) alla trasmissione ed all’utilizzazione dell’energia elettrica (nelle costruzioni civili, nell’industria, nel terziario, nei servizi territoriali, nei trasporti, nello spazio, etc.). A tale contesto afferiscono, in particolare, argomenti quali la sicurezza elettrica, l'automazione, l'affidabilità e la diagnostica dei sistemi elettrici, la tecnica delle alte tensioni, la gestione dell'energia elettrica l'ingegneria dei materiali per i sistemi elettrici, gli impianti elettrici di bordo, i sistemi per i trasporti elettrificati e la multiforme gamma degli impianti elettrici speciali, dalla domotica sino ai vari sistemi computerizzati. Gli aspetti trattati comprendono l’analisi, la pianificazione, la progettazione, la realizzazione, la gestione ed il controllo dei sistemi. Gli strumenti utilizzati appartengono all’intera gamma delle varie metodologie elettriche ed includono, nell'ambito applicativo dell’impiantistica elettrica, l’automazione, l’informatica, l’elettronica di potenza e le comunicazioni, nonché gli aspetti metodologici dell’affidabilità, della qualità, della sicurezza e dell’economicità. Sono, altresì, inclusi gli aspetti progettuali e tecnologici e di compatibilità elettromagnetica ed ambientale.
editorial note: Fonte: Decreto Ministeriale 4 ottobre 2000 [In rete] http://attiministeriali.miur.it/anno-2000/ottobre/dm-04102000.aspx (26 febbraio 2018)
in scheme: subject-disciplines
notation: 011.033
preferred label: electrical power systems @en
has rank order: 2