ingegneria economico-gestionale
type: Concept
broader: https://w3id.org/italia/controlled-vocabulary/classifications-for-culture/subject-disciplines/011
has rank order: 2
definition: Il settore raggruppa le competenze per l’integrazione degli aspetti progettuali, economici, organizzativi e gestionali in campo ingegneristico. In esso si possono identificare due grandi filoni tematici. Il primo filone è rivolto all’integrazione delle conoscenze economiche e gestionali orientate alla progettazione, evidenziando le implicazioni economiche dei progetti, le relazioni tra scelte progettuali e prestazioni aziendali, le relazioni tra progettazione ed implementazione delle innovazioni, le modalità di finanziamento dei progetti, la connessione con il contesto in cui l’impresa opera. Il secondo filone approfondisce le diverse professionalità caratterizzanti l’ingegneria gestionale, integrando, per ciascuna di esse, le competenze economiche, organizzative e tecnologiche con un approccio in cui coesistono le seguenti componenti della cultura ingegneristica: la finalizzazione progettuale, l’ottica basata sulla teoria dei sistemi e del controllo, l’enfasi sulla modellizzazione e sui metodi quantitativi, l’integrazione tra modelli teorici e verifica empirica.
related match: http://thes.bncf.firenze.sbn.it/termine.php
notation: 011.035
in scheme: subject-disciplines
editorial note: Fonte: Decreto Ministeriale 4 ottobre 2000 [In rete] http://attiministeriali.miur.it/anno-2000/ottobre/dm-04102000.aspx (26 febbraio 2018)
preferred label: business and management engineering @en