elettronica
type: Concept
has rank order: 2
editorial note: Fonte: Decreto Ministeriale 4 ottobre 2000 [In rete] http://attiministeriali.miur.it/anno-2000/ottobre/dm-04102000.aspx (26 febbraio 2018)
preferred label: electronics @en
definition: Il settore raccoglie le competenze tecniche e scientifice necessarie per concepire, analizzare, progettare, realizzare, caratterizzare e collaudare dispositivi, circuiti e sistemi che rappresentano la base delle moderne tecnologie della comunicazione e dell’informazione. Le attività di interesse includono: studi teorici e sperimentali di principi fisici e di tecnologie; progettazione e realizzazione di dispositivi, circuiti, apparati e sistemi sulla base delle specifiche, delle normative e dei costi fissati dalle applicazioni; caratterizzazione e collaudo mediante misure di prestazioni ed affidabilità degli oggetti di cui al punto precedente. Il settore contiene un’ampia gamma di competenze (dispositivi a semiconduttore per bassa e per alta frequenza, circuiti, microcircuiti, architetture ed algoritmi per l’elaborazione delle informazioni, sensori, attuatori e microsistemi, strumentazione elettronica, dispositivi e circuiti per applicazioni industriali e di potenza, optoelettronica, strumenti informatici per la progettazione assistita, ecc.), ciascuna comprendente aspetti di tipo metodologico, progettuale, tecnologico e sperimentale. Esso è fortemente interessato alle applicazioni dei sistemi elettronici, che dettano anche le specifiche per il progetto, la realizzazione e la qualità (nella moderna accezione del termine), come, in particolare l'elaborazione e la trasmissione delle informazioni; l'elettronica industriale e di potenza; l'elettronica per la salute, l’ambiente, il turismo, i beni culturali, la casa e lo spazio.
broader: https://w3id.org/italia/controlled-vocabulary/classifications-for-culture/subject-disciplines/012
in scheme: subject-disciplines
related match: http://thes.bncf.firenze.sbn.it/termine.php
notation: 012.001