campi elettromagnetici
type: Concept
broader: 012
definition: Il settore trae la sua origine storica dallo studio delle onde elettromagnetiche attraverso le equazioni di Maxwell. Questo modello, tuttora assai moderno, offre continue opportunità di analisi deduttive e spunti formali, costituendo ampia base di lavoro per gli studiosi di teoria dell’elettromagnetismo. Gli sviluppi iniziali sono stati rivolti alle telecomunicazioni; da qui traggono origine gli studi sulla propagazione libera e guidata e sui metodi di progettazione delle antenne, veri assi portanti del settore, assieme all’analisi dei problemi di diffusione. I più recenti sviluppi degli studi della propagazione si sono indirizzati verso la caratterizzazione del canale per le comunicazioni mobili e verso i componenti e sistemi ottici. La progettazione dei circuiti passivi ad altissima frequenza si è sviluppata in parallelo, analizzando situazioni via via più complesse, con varietà di elementi, anche attivi: è l’area dei componenti e circuiti a microonde e ad onde millimetriche. Più recentemente si sono sviluppati i settori del telerilevamento, fondamentale per la diagnostica dell'ambiente, in particolare attraverso i moderni radar, e quello degli effetti biologici dei campi elettromagnetici, fondamentale per controllare che lo sviluppo dei sistemi via radio non costituisca danno per gli esseri viventi e per individuare applicazioni mediche. Si sono, inoltre, ampliati gli studi sui problemi di compatibilità elettromagnetica, cui si accompagnano le applicazioni industriali per il trattamento dei materiali e la realizzazione di sensori.
editorial note: Fonte: Decreto Ministeriale 4 ottobre 2000 [In rete] http://attiministeriali.miur.it/anno-2000/ottobre/dm-04102000.aspx (26 febbraio 2018)
in scheme: subject-disciplines
notation: 012.002
preferred label: electromagnetic fields @en
related match: http://thes.bncf.firenze.sbn.it/termine.php
has rank order: 2