automatica
type: Concept
broader: 012
definition: Il settore studia i metodi e le tecnologie per il trattamento dell'informazione (dati e segnali) finalizzato all'automazione (ossia alla pianificazione, alla gestione ed al controllo, effettuati in maniera automatica) degli impianti, dei processi e dei sistemi dinamici in genere. Con tali termini possono intendersi, ad esempio, i processi industriali di produzione (sia continua sia manifatturiera), le macchine operatrici automatiche (inclusi i sistemi robotizzati), i sistemi di trasporto, i sistemi per la produzione energetica, i sistemi avionici, nonché i sistemi di natura ambientale. Nonostante le differenze di carattere fisico-strutturale esistenti fra tali tipologie di sistemi, le varie classi di processo sopra menzionate si prestano, tuttavia, ad essere rappresentate, modellate e simulate, ed infine gestite e controllate, utilizzando strumenti metodologici largamente invarianti rispetto al particolare dominio applicativo considerato. Su tale approccio unificante si sviluppano sia campi di competenze di natura metodologica generale, sia quelli orientati allo studio ed al trattamento di problematiche di interesse e di impegno del settore con più rilevanti contenuti di carattere tecnologico.
editorial note: Fonte: Decreto Ministeriale 4 ottobre 2000 [In rete] http://attiministeriali.miur.it/anno-2000/ottobre/dm-04102000.aspx (26 febbraio 2018)
in scheme: subject-disciplines
notation: 012.004
preferred label: systems and control engineering @en
has rank order: 2