bioingegneria elettronica e informatica
type: Concept
alternative label: bioingegneria informatica
alternative label: bioingegneria elettronica
editorial note: Fonte: Decreto Ministeriale 4 ottobre 2000 [In rete] http://attiministeriali.miur.it/anno-2000/ottobre/dm-04102000.aspx (26 febbraio 2018)
preferred label: electronic and informatics bioengineering @en
broader: https://w3id.org/italia/controlled-vocabulary/classifications-for-culture/subject-disciplines/012
in scheme: subject-disciplines
definition: Il settore nasce dall’integrazione organica delle metodologie e delle tecnologie proprie dell'ingegneria, principalmente dell'informazione, con le problematiche mediche e biologiche delle scienze della vita, dell’ingegneria clinica, del mondo del lavoro e dello sport. Le metodologie di base del settore riguardano la modellistica dei sistemi fisiologici (dai componenti cellulari, agli apparati ed agli organi); la descrizione dei fenomeni elettrici e/o magnetici e le apparecchiature per misurarli e modificarli; l’elaborazione di dati e segnali; le bioimmagini; la rappresentazione della conoscenza medico-biologica. Le tecnologie includono la strumentazione biomedica e biotecnologica (diagnostica, terapeutica, riabilitativa: dai componenti elementari ai sistemi ospedalieri integrati); le protesi, i robot biomedici, i sistemi intelligenti artificiali; i sistemi per la gestione e l’organizzazione sanitaria; i sistemi informativi a livello di paziente, reparto, ospedale, regione, paese; l’informatica medica; la telemedicina. Le aree di ricerca avanzata nella biologia e nelle neuroscienze comprendono l’ingegneria delle cellule e dei tessuti, le tecniche informatiche per la biologia e la neurologia (neuroinformatica e la bioinformatica), la bioelettronica.
has rank order: 2
notation: 012.006