storia greca
type: Concept
broader: 013
definition: Comprende gli studi sulla storia e le antichità del mondo greco, a partire dalle più antiche attestazioni fino alla fine dell’evo antico, con riferimento a tutte le regioni ellenizzate e ai diversi campi dell’indagine storiografica, con l’impiego di adeguati strumenti e metodologie di ricerca, comprese in particolare l'epigrafia, l'esegesi delle fonti, in particolare quelle storiografiche, la geografia storica e la storia economica e sociale, nonché gli studi sulle tecniche didattiche di trasmissione delle conoscenze relative al settore.
editorial note: Fonte: Decreto Ministeriale 4 ottobre 2000 [In rete] http://attiministeriali.miur.it/anno-2000/ottobre/dm-04102000.aspx (26 febbraio 2018)
in scheme: subject-disciplines
notation: 013.002
preferred label: greek history @en
has rank order: 2