numismatica
type: Concept
broader: 013
definition: Comprende gli studi sulla monetazione antica, medievale e moderna, in area europea ed extraeuropea, con riferimento agli aspetti storici, economici ed iconologici ed in connessione con gli studi di sfragistica e di araldica.
editorial note: Fonte: Decreto Ministeriale 4 ottobre 2000 [In rete] http://attiministeriali.miur.it/anno-2000/ottobre/dm-04102000.aspx (26 febbraio 2018)
in scheme: subject-disciplines
notation: 013.004
preferred label: numismatics @en
related match: numismatica
related match: http://thes.bncf.firenze.sbn.it/termine.php
has rank order: 2