papirologia
type: Concept
broader: 013
definition: Comprende gli studi sui papiri in vario modo pervenuti, con riferimento alle tecniche di conservazione, di svolgimento (per quelli ercolanesi), di analisi materiale, di restauro, di lettura, di interpretazione, di utilizzazione con finalità letterarie, filosofiche, filologiche e storico-documentarie.
editorial note: Fonte: Decreto Ministeriale 4 ottobre 2000 [In rete] http://attiministeriali.miur.it/anno-2000/ottobre/dm-04102000.aspx (26 febbraio 2018)
in scheme: subject-disciplines
notation: 013.005
preferred label: papyrology @en
related match: http://thes.bncf.firenze.sbn.it/termine.php
has rank order: 2