etruscologia e antichità italiche
type: Concept
in scheme: subject-disciplines
related match: etruscologia
related match: http://thes.bncf.firenze.sbn.it/termine.php
preferred label: etruscology and italic antiquities @en
has rank order: 2
editorial note: Fonte: Decreto Ministeriale 4 ottobre 2000 [In rete] http://attiministeriali.miur.it/anno-2000/ottobre/dm-04102000.aspx (26 febbraio 2018)
definition: Comprende gli studi sulle popolazioni dell’Italia antica in riferimento alle loro caratteristiche culturali rilevabili dalla rispettive lingue e dalle produzioni artistiche e materiali, studi condotti secondo le metodologie e tecniche tipiche dell’archeologia, dell’epigrafia e della storia delle arti, nonché aspetti di didattica del museo e del parco archeologico applicata ad ambienti e reperti dell’Italia etrusca e preromana.
broader: https://w3id.org/italia/controlled-vocabulary/classifications-for-culture/subject-disciplines/013
notation: 013.006
alternative label: etruscologia