archeologia classica
type: Concept
related match: archeologia classica
in scheme: subject-disciplines
preferred label: classical archaeology @en
broader: https://w3id.org/italia/controlled-vocabulary/classifications-for-culture/subject-disciplines/013
editorial note: Fonte: Decreto Ministeriale 4 ottobre 2000 [In rete] http://attiministeriali.miur.it/anno-2000/ottobre/dm-04102000.aspx (26 febbraio 2018)
notation: 013.008
definition: Comprende gli studi sul patrimonio architettonico e delle arti figurative e sui documenti della cultura materiale relativi alle aree ed alle età delle civiltà greca e romana dalle loro origini alla tarda antichità, con riferimento alla valutazione storica, culturale ed artistica del materiale studiato e alla storia della disciplina e della sua epistemologia, anche allo scopo di potenziare la didattica del museo e del parco archeologico.
narrower: https://w3id.org/italia/controlled-vocabulary/classifications-for-culture/subject-disciplines/013-008-001
has rank order: 2
narrower: https://w3id.org/italia/controlled-vocabulary/classifications-for-culture/subject-disciplines/013-008-002
alternative label: classic archaeology @en