archeologia cristiana e medievale
type: Concept
in scheme: subject-disciplines
preferred label: christian and medieval archaeology @en
notation: 013.009
alternative label: archeologia cristiana
alternative label: archeologia medievale
broader: https://w3id.org/italia/controlled-vocabulary/classifications-for-culture/subject-disciplines/013
has rank order: 2
editorial note: Fonte: Decreto Ministeriale 4 ottobre 2000 [In rete] http://attiministeriali.miur.it/anno-2000/ottobre/dm-04102000.aspx (26 febbraio 2018)
related match: http://thes.bncf.firenze.sbn.it/termine.php
definition: Comprende gli studi sugli scavi archeologici, sul patrimonio architettonico e delle arti figurative e sui documenti della cultura materiale relativi all’Europa ed al mondo mediterraneo nell'epoca tardoantica, cristiana e in quella medievale, con riferimento alla valutazione storica, culturale ed artistica dei risultati, nonché agli aspetti di didattica del museo e del parco archeologico applicata ad ambienti e reperti di età tardoantica, cristiana e di quella medievale. Si occupa altresì dello studio delle epigrafi cristiane e medievali, nonché degli insediamenti e della topografia medievale.