metodologie della ricerca archeologica
type: Concept
broader: 013
definition: Comprende gli studi relativi ai contenuti metodologici delle discipline archeologiche, con particolare riferimento agli aspetti tecnico-operativi, sul campo e in laboratorio, nei diversi ambiti geografici e culturali, con l'impiego di particolari metodi di indagine, dalle applicazioni archeometriche ai metodi informatici della ricerca archeologica, e con la collaborazione con altre competenze, comprese quelle di discipline appartenenti alle aree delle scienze esatte ed applicate, anche ai fini della conservazione e tutela del materiale archeologico.
editorial note: Fonte: Decreto Ministeriale 4 ottobre 2000 [In rete] http://attiministeriali.miur.it/anno-2000/ottobre/dm-04102000.aspx (26 febbraio 2018)
in scheme: subject-disciplines
notation: 013.012
preferred label: methods of archaeological research @en
has rank order: 2