civiltà egee
type: Concept
broader: 014
definition: Comprende gli studi di carattere archeologico, filologico e storico che hanno per oggetto la civiltà minoico-micenea considerata nel quadro generale delle civiltà mediterranee, e in particolare i suoi rapporti con il mondo ellenico del primo millennio e con le varie zone ove è attestata o determinante la presenza della civiltà greca (Creta, Cipro, le Cicladi, la costa anatolica, quella siro- palestinese, la valle del Nilo e l’Italia meridionale etc.), nonché l’analisi linguistica e informatica dei testi.
editorial note: Fonte: Decreto Ministeriale 4 ottobre 2000 [In rete] http://attiministeriali.miur.it/anno-2000/ottobre/dm-04102000.aspx (26 febbraio 2018)
in scheme: subject-disciplines
notation: 014.001
preferred label: aegean civilizations @en
has rank order: 2