lingua e letteratura greca
type: Concept
alternative label: letteratura greca
alternative label: lingua greca
notation: 014.002
related match: http://thes.bncf.firenze.sbn.it/termine.php
has rank order: 2
preferred label: greek language and literrature @en
related match: letteratura greca
definition: Comprende gli studi filologici e letterari sulle opere in lingua greca e sui relativi autori dalle origini alla fine dell’evo antico, condotti con gli strumenti propri e le metodologie della ricerca filologica, linguistica e critico-letteraria con riferimento alla lingua greca, ai suoi dialetti e alla sua storia, nonché quelli sulle tecniche didattiche di trasmissione delle conoscenze relative al settore e quelli per l’analisi linguistica e informatica dei testi.
in scheme: subject-disciplines
broader: https://w3id.org/italia/controlled-vocabulary/classifications-for-culture/subject-disciplines/014
editorial note: Fonte: Decreto Ministeriale 4 ottobre 2000 [In rete] http://attiministeriali.miur.it/anno-2000/ottobre/dm-04102000.aspx (26 febbraio 2018)