lingua e letteratura latina
type: Concept
alternative label: lingua latina
alternative label: letteratura latina
broader: 014
definition: Comprende gli studi filologici e letterari sulle opere in lingua latina e sui relativi autori dalle origini alla fine dell’evo antico, compresa l’età degli stati romano barbarici, studi condotti con gli strumenti propri e le metodologie della ricerca filologica, linguistica e critico-letteraria, con riferimento alla lingua latina e alla sua storia, nonché quelli sulle tecniche didattiche di trasmissione delle conoscenze relative al settore e quelli per l’analisi linguistica e informatica dei testi.
editorial note: Fonte: Decreto Ministeriale 4 ottobre 2000 [In rete] http://attiministeriali.miur.it/anno-2000/ottobre/dm-04102000.aspx (26 febbraio 2018)
in scheme: subject-disciplines
notation: 014.005
preferred label: latin language and literature @en
related match: http://thes.bncf.firenze.sbn.it/termine.php
related match: letteratura latina
has rank order: 2