filologia classica
type: Concept
has rank order: 2
in scheme: subject-disciplines
preferred label: classical philology @en
broader: https://w3id.org/italia/controlled-vocabulary/classifications-for-culture/subject-disciplines/014
definition: Comprende gli studi che applicano a testi antichi, greci e latini, i metodi della ricerca filologica, in aspetti e settori che richiedano competenza contemporaneamente nei due campi della letteratura classica, nonché le ricerche sul teatro antico greco e latino, sulla fortuna della cultura antica, sulla storia degli studi classici e sulla didattica delle lingue classiche, sull’analisi linguistica e informatica dei testi.
related match: http://thes.bncf.firenze.sbn.it/termine.php
notation: 014.007
related match: filologia classica
editorial note: Fonte: Decreto Ministeriale 4 ottobre 2000 [In rete] http://attiministeriali.miur.it/anno-2000/ottobre/dm-04102000.aspx (26 febbraio 2018)