letteratura cristiana antica
type: Concept
definition: Comprende gli studi sulle opere antiche di argomento cristiano sia in lingua greca sia in lingua latina nonché in altre lingue coeve della tradizione cristiana, con riferimento ai testi antichi vetero e neotestamentari, esegetici, agiografici, omiletici, apologetici, studi condotti con le metodologie della ricerca filologica e critico-letteraria anche attraverso l’analisi linguistica e informatica dei testi.
editorial note: Fonte: Decreto Ministeriale 4 ottobre 2000 [In rete] http://attiministeriali.miur.it/anno-2000/ottobre/dm-04102000.aspx (26 febbraio 2018)
broader: https://w3id.org/italia/controlled-vocabulary/classifications-for-culture/subject-disciplines/014
in scheme: subject-disciplines
preferred label: ancient christian literature @en
notation: 014.008
has rank order: 2
related match: http://thes.bncf.firenze.sbn.it/termine.php