filologia e linguistica romanza
type: Concept
notation: 014.011
alternative label: linguistica romanza
has rank order: 2
preferred label: romance philology and linguistics @en
broader: https://w3id.org/italia/controlled-vocabulary/classifications-for-culture/subject-disciplines/014
alternative label: filologia romanza
in scheme: subject-disciplines
editorial note: Fonte: Decreto Ministeriale 4 ottobre 2000 [In rete] http://attiministeriali.miur.it/anno-2000/ottobre/dm-04102000.aspx (26 febbraio 2018)
related match: http://thes.bncf.firenze.sbn.it/termine.php
definition: Comprende gli studi sulle origini e sullo sviluppo delle lingue e delle letterature neolatine con speciale riguardo ai secoli medievali, valutate anche con l’impiego di metodologie filologiche e linguistiche e con particolare attenzione agli aspetti comparatistici, e quelli per l’analisi linguistica e informatica di testi e corpora; comprende altresì gli studi di linguistica sarda e siciliana, di filologia ibero- romanza e gallo-romanza e quelli di carattere linguistico e letterario relativi a tutta la produzione scritta nelle lingue catalana, ladina e provenzale (occitano).