linguistica italiana
type: Concept
broader: 014
definition: Comprende gli studi sulla lingua italiana e sui dialetti parlati in Italia, con riferimento alle strutture fonetiche, fonologiche, morfologiche, sintattiche e lessicologiche, all’evoluzione di tali sistemi, alla storia degli usi sociali e assetti geolinguistici, alle tradizioni testuali e stilistiche, alle problematiche teoriche e applicative, nonché alle problematiche e metodologie di didattica della lingua italiana per italiani e per stranieri e all’analisi linguistica e informatica di testi e corpora.
editorial note: Fonte: Decreto Ministeriale 4 ottobre 2000 [In rete] http://attiministeriali.miur.it/anno-2000/ottobre/dm-04102000.aspx (26 febbraio 2018)
in scheme: subject-disciplines
notation: 014.014
preferred label: italian linguistics @en
has rank order: 2