filologia della letteratura italiana
type: Concept
broader: https://w3id.org/italia/controlled-vocabulary/classifications-for-culture/subject-disciplines/014
notation: 014.015
editorial note: Fonte: Decreto Ministeriale 4 ottobre 2000 [In rete] http://attiministeriali.miur.it/anno-2000/ottobre/dm-04102000.aspx (26 febbraio 2018)
has rank order: 2
definition: Comprende gli studi su testi prodotti in Italia a partire dal Medioevo – con particolare attenzione all’opera di Dante e alla produzione umanistica e rinascimentale – redatti nelle lingue di cultura dell’Europa occidentale e analizzati con metodologia prevalentemente filologica che ne ricostruisca la tradizione testuale e letteraria anche attraverso l’analisi linguistica e informatica di testi e corpora.
preferred label: philology of italian literature @en
in scheme: subject-disciplines