critica letteraria e letterature comparate
type: Concept
definition: Comprende gli studi che affrontano a livello teorico ed ermeneutico il problema generale della letteratura, dei generi, della produzione, diffusione e valutazione dei testi, e quello del confronto fra testi appartenenti a diverse letterature e culture, anche ai fini della loro resa letteraria in una lingua diversa da quella in cui sono stati elaborati, con l’eventuale impiego dell’analisi linguistica e informatica di testi e corpora.
related match: http://thes.bncf.firenze.sbn.it/termine.php
related match: critica letteraria
alternative label: letterature comparate
has rank order: 2
editorial note: Fonte: Decreto Ministeriale 4 ottobre 2000 [In rete] http://attiministeriali.miur.it/anno-2000/ottobre/dm-04102000.aspx (26 febbraio 2018)
broader: https://w3id.org/italia/controlled-vocabulary/classifications-for-culture/subject-disciplines/014
preferred label: literary criticism and comparative literature @en
alternative label: critica letteraria
in scheme: subject-disciplines
notation: 014.016