filologia germanica
type: Concept
in scheme: subject-disciplines
related match: http://thes.bncf.firenze.sbn.it/termine.php
definition: Comprende gli studi sulle lingue appartenenti al gruppo germanico e sulle più antiche produzioni letterarie, valutate con l’impiego di metodologie filologiche e linguistiche, nonché lo studio della cultura delle popolazioni germaniche, con particolare attenzione alla sua eredità nelle aree linguistiche non germaniche come pure agli elementi del mito e a quelli trasmessi dalla tradizione popolare, con l’eventuale impiego dell’analisi linguistica e informatica di testi e corpora.
has rank order: 2
preferred label: germanic philology @en
broader: https://w3id.org/italia/controlled-vocabulary/classifications-for-culture/subject-disciplines/014
notation: 014.017
editorial note: Fonte: Decreto Ministeriale 4 ottobre 2000 [In rete] http://attiministeriali.miur.it/anno-2000/ottobre/dm-04102000.aspx (26 febbraio 2018)