storia dell'arte medievale
type: Concept
broader: 015
definition: Comprende, con particolare attenzione all’area europea, gli studi sulle opere architettoniche, scultoree, pittoriche, grafiche, sulla miniatura e le cosiddette arti minori e sulla produzione artigianale nell’età medievale, nell'occidente europeo e in ambito bizantino, studi condotti anche con gli strumenti dell’iconografia e iconologia, della letteratura artistica e della sociologia dell’arte, con riferimento alla storia della disciplina e della sua epistemologia, anche allo scopo di potenziare la didattica del museo.
editorial note: Fonte: Decreto Ministeriale 4 ottobre 2000 [In rete] http://attiministeriali.miur.it/anno-2000/ottobre/dm-04102000.aspx (26 febbraio 2018)
in scheme: subject-disciplines
notation: 015.001
preferred label: history of medieval art @en
has rank order: 2