storia dell'arte moderna
type: Concept
broader: https://w3id.org/italia/controlled-vocabulary/classifications-for-culture/subject-disciplines/015
notation: 015.002
editorial note: Fonte: Decreto Ministeriale 4 ottobre 2000 [In rete] http://attiministeriali.miur.it/anno-2000/ottobre/dm-04102000.aspx (26 febbraio 2018)
has rank order: 2
definition: Comprende, con particolare attenzione all’area europea, gli studi sulle opere architettoniche, scultoree, pittoriche, delle cosiddette arti minori e della produzione artigianale nell’età moderna, del disegno, dell'incisione e della grafica, studi condotti anche con gli strumenti dell’iconografia e iconologia, della letteratura artistica e della sociologia dell’arte, e con riferimento alla storia della disciplina e della sua epistemologia, anche allo scopo di potenziare la didattica del museo.
preferred label: history of modern art @en
in scheme: subject-disciplines