storia dell'arte contemporanea
type: Concept
broader: https://w3id.org/italia/controlled-vocabulary/classifications-for-culture/subject-disciplines/015
notation: 015.003
editorial note: Fonte: Decreto Ministeriale 4 ottobre 2000 [In rete] http://attiministeriali.miur.it/anno-2000/ottobre/dm-04102000.aspx (26 febbraio 2018)
has rank order: 2
definition: Comprende, con particolare attenzione al mondo europeo e nord-americano, gli studi sulle più attuali tendenze artistiche, non solo nelle tradizionali espressioni ma anche con riferimento alla produzione della società industriale e postindustriale, al disegno, all'incisione, alla grafica, alla fotografia, come pure alla storia della disciplina e della sua epistemologia, anche allo scopo di potenziare la didattica del museo.
preferred label: history of contemporary art @en
in scheme: subject-disciplines