museologia e critica artistica e del restauro
type: Concept
alternative label: critica artistica
alternative label: critica del restauro
alternative label: museologia
broader: 015
definition: Comprende gli studi di carattere teorico e metodologico sulla letteratura artistica, sulla critica d'arte e sulla storia sociale dell’arte e quelli sulla storia e l’organizzazione dei musei e sulla didattica museale, nonché sulle tecniche artistiche e sulla conservazione ed il restauro dei beni artistici.
editorial note: Fonte: Decreto Ministeriale 4 ottobre 2000 [In rete] http://attiministeriali.miur.it/anno-2000/ottobre/dm-04102000.aspx (26 febbraio 2018)
in scheme: subject-disciplines
notation: 015.004
preferred label: museology, art and restoration criticism @en
related match: critica artistica e del restauro
related match: http://thes.bncf.firenze.sbn.it/termine.php
related match: museologia
has rank order: 2