designo industriale
type: Concept
preferred label: industrial design @en
alternative label: disegn industriale
notation: 016.002.001
definition: I contenuti scientifico-disciplinari riguardano teorie e metodi, tecniche e strumenti del progetto del prodotto industriale - materiale o virtuale - nei suoi caratteri produttivi, tecnologico-costruttivi, funzionali, formali e d'uso e nelle relazioni che esso instaura con il contesto spaziale ed ambientale e con quello dell'industria e del mercato. La natura di tale prodotto (dai beni d'uso e strumentali ai beni di consumo e durevoli, agli artefatti comunicativi, relazionali, interattivi, alle strutture relazionali e di servizio) e la sua complessità (dai materiali e semilavorati ai beni intermedi, ai componenti, ai prodotti finali, fino ai sistemi integrati di prodotto, comunicazione, servizio) declinano altrettanti metodi e tecniche della progettazione come prassi interdisciplinare, che, interagendo con i diversi settori merceologici e produttivi, determinano ambiti di ricerca specifici in continua evoluzione.
broader: https://w3id.org/italia/controlled-vocabulary/classifications-for-culture/subject-disciplines/016-002
has rank order: 3
in scheme: subject-disciplines
editorial note: Fonte: Decreto Ministeriale 4 ottobre 2000 [In rete] http://attiministeriali.miur.it/anno-2000/ottobre/dm-04102000.aspx (26 febbraio 2018)