storia del vicino oriente antico
type: Concept
broader: https://w3id.org/italia/controlled-vocabulary/classifications-for-culture/subject-disciplines/018
notation: 018.001
editorial note: Fonte: Decreto Ministeriale 4 ottobre 2000 [In rete] http://attiministeriali.miur.it/anno-2000/ottobre/dm-04102000.aspx (26 febbraio 2018)
has rank order: 2
definition: Comprende gli studi sulla storia politica, istituzionale, sociale, economica, culturale e religiosa dell'area compresa tra Egitto ed Egeo, valle dell'Indo e Asia Centrale nel periodo che va dall'emergere di forme statali complesse e della scrittura (fine del IV millennio a.C.) fino all'ellenismo.
preferred label: history of ancient near east @en
in scheme: subject-disciplines