egittologia e civiltà copta
type: Concept
definition: Comprende gli studi filologici, storici, archeologici, artistici e religiosi relativi alla documentazione diretta ed indiretta sulle civiltà della valle del Nilo (egiziana, nubiana, copta) nel periodo faraonico, ellenistico e romano, nonché quelli sulla cultura egizia nel periodo cristiano condotti attraverso l'analisi della documentazione in lingua copta e della coeva produzione artistica.
editorial note: Fonte: Decreto Ministeriale 4 ottobre 2000 [In rete] http://attiministeriali.miur.it/anno-2000/ottobre/dm-04102000.aspx (26 febbraio 2018)
related match: http://thes.bncf.firenze.sbn.it/termine.php
alternative label: egittologia
related match: egittologia
notation: 018.002
has rank order: 2
in scheme: subject-disciplines
broader: https://w3id.org/italia/controlled-vocabulary/classifications-for-culture/subject-disciplines/018
preferred label: egyptology and coptic civilization @en