anatolistica
type: Concept
broader: 018
definition: Comprende gli studi a carattere storico e filologico sulle culture dell'Anatolia del secondo e del primo millennio fino all'età ellenistica e sulle lingue indoeuropee (ittita, luvio, palaico, licio, lidio, cario, frigio) e non indoeuropee (hattico, hurrico, urarteo) che ne furono il mezzo di comunicazione nelle loro diverse forme scrittorie (cuneiforme, geroglifica, alfabetiche).
editorial note: Fonte: Decreto Ministeriale 4 ottobre 2000 [In rete] http://attiministeriali.miur.it/anno-2000/ottobre/dm-04102000.aspx (26 febbraio 2018)
in scheme: subject-disciplines
notation: 018.004
preferred label: anatolian studies @en
has rank order: 2