ebraico
type: Concept
broader: https://w3id.org/italia/controlled-vocabulary/classifications-for-culture/subject-disciplines/018
notation: 018.008
editorial note: Fonte: Decreto Ministeriale 4 ottobre 2000 [In rete] http://attiministeriali.miur.it/anno-2000/ottobre/dm-04102000.aspx (26 febbraio 2018)
has rank order: 2
definition: Comprende lo studio e l'insegnamento della lingua e della produzione letteraria ebraica dalle origini ai nostri giorni, nei vari periodi e ambienti culturali che hanno spesso generato situazioni di plurilinguismo a partire dalla stessa Bibbia, con l'impiego di metodologie di natura filologica; comprende inoltre gli studi finalizzati alla pratica e alla riflessione sull’attività traduttiva, scritta e orale, nelle sue molteplici articolazioni non letteraria, generica e specialistica e nelle applicazioni multimediali (fra cui la traduzione e interpretazione di cui all’art.1 della L.478/84).
preferred label: hebrew @en
in scheme: subject-disciplines