lingue e letterature dell'africa
type: Concept
notation: 018.009
in scheme: subject-disciplines
related match: http://thes.bncf.firenze.sbn.it/termine.php
editorial note: Fonte: Decreto Ministeriale 4 ottobre 2000 [In rete] http://attiministeriali.miur.it/anno-2000/ottobre/dm-04102000.aspx (26 febbraio 2018)
definition: Comprende gli studi sulle letterature e sulla produzione orale e scritta, dalle origini all’età contemporanea, nelle lingue berbera, somala, swahili, hausa, nelle altre lingue bantu e nelle lingue dell’Africa occidentale, convenzionalmente definite "sudanesi" anche se raggruppano differenti famiglie linguistiche (ciadica, mande, voltaica, kru, kwa, adamawa ecc.), studi estesi all'indagine sui dialetti, sulla cultura materiale e sulla storia delle aree interessate, nonché sulle interazioni tra il mondo libico-berbero e le grandi civiltà mediterranee dalla preistoria al mondo moderno. Le metodologie adottate sono quelle della ricerca linguistica, antropologica, demologica, filologica e critico-letteraria.
preferred label: african languages and literatures @en
has rank order: 2
alternative label: letterature africane
alternative label: lingue africane
broader: https://w3id.org/italia/controlled-vocabulary/classifications-for-culture/subject-disciplines/018