archeologia e storia dell'arte musulmana
type: Concept
broader: https://w3id.org/italia/controlled-vocabulary/classifications-for-culture/subject-disciplines/018
notation: 018.011
editorial note: Fonte: Decreto Ministeriale 4 ottobre 2000 [In rete] http://attiministeriali.miur.it/anno-2000/ottobre/dm-04102000.aspx (26 febbraio 2018)
has rank order: 2
definition: Comprende gli studi sugli scavi archeologici, sul patrimonio artistico e architettonico, sui reperti epigrafici e sui documenti della cultura materiale della vasta area, dall'Atlantico alla Cina, su cui si è diffuso l'Islam, o che con esso interagisce o ha interagito, dalle origini all'età moderna, condotti secondo le metodologie e tecniche dell'archeologia e della storia dell'arte.
preferred label: muslim archaeology and art history @en
in scheme: subject-disciplines