lingua e letteratura persiana
type: Concept
related match: http://thes.bncf.firenze.sbn.it/termine.php
editorial note: Fonte: Decreto Ministeriale 4 ottobre 2000 [In rete] http://attiministeriali.miur.it/anno-2000/ottobre/dm-04102000.aspx (26 febbraio 2018)
preferred label: persian language and literature @en
broader: https://w3id.org/italia/controlled-vocabulary/classifications-for-culture/subject-disciplines/018
in scheme: subject-disciplines
notation: 018.015
definition: Comprende gli studi sulla lingua e sulla letteratura persiana e sui documenti letterari, storici e folklorici prodotti, sia in forma scritta che in forma orale, nei dialetti persiani, condotti con le metodologie della ricerca filologica, linguistica, critico-letteraria, paleografica.
has rank order: 2